{"text_format":"1","workbook":"xlsx","n_sheets":6,"sheets":["        Welcome      ","ENTER DATA HERE - Budget","Cash Flow","Income Statement","Sensitivity Analysis","Schedule"],"not_rendered":{"charts":4,"images":8,"macros":1,"external_links":0,"defined_names":40,"comments":0,"pivot_tables":0},"unopened":[],"bounds":{"document_bytes":16777216,"sheet_cells":100000,"rows_first":2000,"rows_last":500,"rows_between":2000,"halvings":0,"cell_chars":16384,"cell_head_chars":4096},"cells_cut":0,"cells_raw":0,"read":"whole","date_system":"1900"}

{"sheet":"        Welcome      ","index":0,"n_rows":29,"n_cols":4,"rows_kept":29,"cut":false,"hidden":false,"merged":[[0,1,2,18],[28,3,28,16]]}
[null,"Cage Aquaculture Analysis"]
[]
[]
[]
[]
[]
{"$rows_left_out":24}
{"sheet":"ENTER DATA HERE - Budget","index":1,"n_rows":96,"n_cols":43,"rows_kept":96,"cut":false,"hidden":false,"merged":[[82,1,82,2],[0,1,0,6],[28,1,28,2],[33,1,33,2],[1,1,1,6],[4,5,4,7],[6,1,6,2],[2,1,2,6]]}
[null,"CAGE CULTURE"]
[null,"The budget presented below is a guide to assist you in projecting costs and returns for your aquaculture enterprise. This spreadsheet is just a tool to be used for planning your aquaculture operation and developing your own budget, specific to your situation."]
[null,"You should change the cells in yellow with blue font to reflect your situation."]
[]
[null,"Choose the fish species from the drop down menu:",null,null,null,"Hybrid Striped Bass"]
[]
{"$rows_left_out":91}
{"sheet":"Cash Flow","index":2,"n_rows":343,"n_cols":29,"rows_kept":343,"cut":false,"hidden":false,"merged":[[208,2,208,13],[242,2,242,13],[276,2,276,13],[310,2,310,13],[0,2,0,13],[174,2,174,13],[2,2,2,13],[38,2,38,13],[72,2,72,13],[106,2,106,13],[140,2,140,13]]}
[null,null,"CASH FLOW"]
[null,"Write down stocking months",{"$f":"'ENTER DATA HERE - Budget'!$C$27","v":"April"},{"$f":"'ENTER DATA HERE - Budget'!$D$27","v":"May"},{"$f":"'ENTER DATA HERE - Budget'!$E$27","v":"June"},{"$f":"'ENTER DATA HERE - Budget'!$F$27","v":0},{"$f":"'ENTER DATA HERE - Budget'!$G$27","v":0},{"$f":"'ENTER DATA HERE - Budget'!$H$27","v":0},{"$f":"'ENTER DATA HERE - Budget'!$I$27","v":0}]
[null,"YEAR 1","YEAR 1",null,null,null,null,null,null,null,null,null,null,null,null,null,null,null,null,"year","month","cages stocked","cages harvested","total Cages in use"]
[null,null,"January","February","March","April","May","June","July","August","September","October","November","December","Total",null,null,1,{"$f":"CONCATENATE(T4,U4)","v":"1January"},1,"January",{"$f":"IF(OR(U4=$C$2,U4=$D$2,U4=$E$2),'ENTER DATA HERE - Budget'!$E$10,0)","v":0},{"$f":"IF(R4<='ENTER DATA HERE - Budget'!E$8,0,VLOOKUP(R4-'ENTER DATA HERE - Budget'!$E$8,$R3:$V4,5,FALSE))","v":0},{"$f":"SUM($V$4:V4)-SUM($W$4:W4)","v":0},null,1,"January",1,13]
[1,"Gross Receipts:",null,null,null,null,null,null,null,null,null,null,null,null,null,null,null,2,{"$f":"CONCATENATE(T5,U5)","v":"1February"},1,"February",{"$f":"IF(OR(U5=$C$2,U5=$D$2,U5=$E$2),'ENTER DATA HERE - Budget'!$E$10,0)","v":0},{"$f":"IF(R5<='ENTER DATA HERE - Budget'!E$8,0,VLOOKUP(R5-'ENTER DATA HERE - Budget'!$E$8,$R4:V$4,5,FALSE))","v":0},{"$f":"SUM($V$4:V5)-SUM($W$4:W5)","v":0},null,2,"February",2,14]
[null,null,null,null,null,null,null,null,null,null,null,null,null,null,null,null,null,3,{"$f":"CONCATENATE(T6,U6)","v":"1March"},1,"March",{"$f":"IF(OR(U6=$C$2,U6=$D$2,U6=$E$2),'ENTER DATA HERE - Budget'!$E$10,0)","v":0},{"$f":"IF(R6<='ENTER DATA HERE - Budget'!E$8,0,VLOOKUP(R6-'ENTER DATA HERE - Budget'!$E$8,$R$4:V5,5,FALSE))","v":0},{"$f":"SUM($V$4:V6)-SUM($W$4:W6)","v":0},null,3,"March",3,15]
{"$rows_left_out":338}
{"sheet":"Income Statement","index":3,"n_rows":51,"n_cols":13,"rows_kept":51,"cut":false,"hidden":false,"merged":[[0,3,0,8]]}
[null,null,null,"INCOME STATEMENT                                            "]
[null,null,null,"Year 1","Year 2","Year 3","Year 4","Year 5","Year 6","Year 7","Year 8","Year 9","Year 10"]
[null,"REVENUE"]
[null,"Fish Sales",null,{"$f":"'Cash Flow'!$O$7","v":0},{"$f":"'Cash Flow'!$O$42","v":56175.910312500011},{"$f":"'Cash Flow'!$O$76","v":56175.910312500011},{"$f":"'Cash Flow'!$O$110","v":56175.910312500011},{"$f":"'Cash Flow'!$O$144","v":56175.910312500011},{"$f":"'Cash Flow'!$O$178","v":56175.910312500011},{"$f":"'Cash Flow'!$O$212","v":56175.910312500011},{"$f":"'Cash Flow'!O246","v":56175.910312500011},{"$f":"'Cash Flow'!O280","v":56175.910312500011},{"$f":"'Cash Flow'!O314","v":56175.910312500011}]
[null,"Other Income",null,{"$f":"'Cash Flow'!$O$9","v":0},{"$f":"'Cash Flow'!$O$44","v":0},{"$f":"'Cash Flow'!$O$78","v":0},{"$f":"'Cash Flow'!$O$112","v":0},{"$f":"'Cash Flow'!$O$146","v":0},{"$f":"'Cash Flow'!$O$180","v":0},{"$f":"'Cash Flow'!$O$214","v":0},{"$f":"'Cash Flow'!O248","v":0},{"$f":"'Cash Flow'!O282","v":0},{"$f":"'Cash Flow'!O316","v":0}]
[null," Min Gross Revenue",null,{"$f":"SUM(D4:D5)","v":0},56175.910312500011,56175.910312500011,56175.910312500011,56175.910312500011,56175.910312500011,56175.910312500011,56175.910312500011,56175.910312500011,56175.910312500011]
{"$rows_left_out":46}
{"sheet":"Sensitivity Analysis","index":4,"n_rows":32,"n_cols":10,"rows_kept":32,"cut":false,"hidden":false,"merged":[[2,0,3,0],[21,0,22,0],[2,1,2,9],[1,1,1,9],[20,1,20,9],[21,1,21,9]]}
[]
[null,"Sensitivity Analysis - Estimated Net Returns Per Cage Above Variable/Overhead Costs"]
["Feed price $/lb","Sale price $/lb"]
[null,2.8,2.85,2.9,2.95,3,3.05,3.1,3.15,3.2]
[0.35,{"$f":"(B$4*'ENTER DATA HERE - Budget'!$F$30*'ENTER DATA HERE - Budget'!$E$9-('ENTER DATA HERE - Budget'!$H$45-'ENTER DATA HERE - Budget'!$H$36)-'ENTER DATA HERE - Budget'!$F$36*'ENTER DATA HERE - Budget'!$E$9*'Sensitivity Analysis'!$A5-'ENTER DATA HERE - Budget'!$H$54)/('ENTER DATA HERE - Budget'!$E$9*'ENTER DATA HERE - Budget'!$E$10)","v":976.60399481510422},{"$f":"(C$4*'ENTER DATA HERE - Budget'!$F$30*'ENTER DATA HERE - Budget'!$E$9-('ENTER DATA HERE - Budget'!$H$45-'ENTER DATA HERE - Budget'!$H$36)-'ENTER DATA HERE - Budget'!$F$36*'ENTER DATA HERE - Budget'!$E$9*'Sensitivity Analysis'!$A5-'ENTER DATA HERE - Budget'!$H$54)/('ENTER DATA HERE - Budget'!$E$9*'ENTER DATA HERE - Budget'!$E$10)","v":1007.8128338776044},{"$f":"(D$4*'ENTER DATA HERE - Budget'!$F$30*'ENTER DATA HERE - Budget'!$E$9-('ENTER DATA HERE - Budget'!$H$45-'ENTER DATA HERE - Budget'!$H$36)-'ENTER DATA HERE - Budget'!$F$36*'ENTER DATA HERE - Budget'!$E$9*'Sensitivity Analysis'!$A5-'ENTER DATA HERE - Budget'!$H$54)/('ENTER DATA HERE - Budget'!$E$9*'ENTER DATA HERE - Budget'!$E$10)","v":1039.0216729401043},{"$f":"(E$4*'ENTER DATA HERE - Budget'!$F$30*'ENTER DATA HERE - Budget'!$E$9-('ENTER DATA HERE - Budget'!$H$45-'ENTER DATA HERE - Budget'!$H$36)-'ENTER DATA HERE - Budget'!$F$36*'ENTER DATA HERE - Budget'!$E$9*'Sensitivity Analysis'!$A5-'ENTER DATA HERE - Budget'!$H$54)/('ENTER DATA HERE - Budget'!$E$9*'ENTER DATA HERE - Budget'!$E$10)","v":1070.2305120026042},{"$f":"(F$4*'ENTER DATA HERE - Budget'!$F$30*'ENTER DATA HERE - Budget'!$E$9-('ENTER DATA HERE - Budget'!$H$45-'ENTER DATA HERE - Budget'!$H$36)-'ENTER DATA HERE - Budget'!$F$36*'ENTER DATA HERE - Budget'!$E$9*'Sensitivity Analysis'!$A5-'ENTER DATA HERE - Budget'!$H$54)/('ENTER DATA HERE - Budget'!$E$9*'ENTER DATA HERE - Budget'!$E$10)","v":1101.4393510651041},{"$f":"(G$4*'ENTER DATA HERE - Budget'!$F$30*'ENTER DATA HERE - Budget'!$E$9-('ENTER DATA HERE - Budget'!$H$45-'ENTER DATA HERE - Budget'!$H$36)-'ENTER DATA HERE - Budget'!$F$36*'ENTER DATA HERE - Budget'!$E$9*'Sensitivity Analysis'!$A5-'ENTER DATA HERE - Budget'!$H$54)/('ENTER DATA HERE - Budget'!$E$9*'ENTER DATA HERE - Budget'!$E$10)","v":1132.6481901276043},{"$f":"(H$4*'ENTER DATA HERE - Budget'!$F$30*'ENTER DATA HERE - Budget'!$E$9-('ENTER DATA HERE - Budget'!$H$45-'ENTER DATA HERE - Budget'!$H$36)-'ENTER DATA HERE - Budget'!$F$36*'ENTER DATA HERE - Budget'!$E$9*'Sensitivity Analysis'!$A5-'ENTER DATA HERE - Budget'!$H$54)/('ENTER DATA HERE - Budget'!$E$9*'ENTER DATA HERE - Budget'!$E$10)","v":1163.8570291901042},{"$f":"(I$4*'ENTER DATA HERE - Budget'!$F$30*'ENTER DATA HERE - Budget'!$E$9-('ENTER DATA HERE - Budget'!$H$45-'ENTER DATA HERE - Budget'!$H$36)-'ENTER DATA HERE - Budget'!$F$36*'ENTER DATA HERE - Budget'!$E$9*'Sensitivity Analysis'!$A5-'ENTER DATA HERE - Budget'!$H$54)/('ENTER DATA HERE - Budget'!$E$9*'ENTER DATA HERE - Budget'!$E$10)","v":1195.0658682526046},{"$f":"(J$4*'ENTER DATA HERE - Budget'!$F$30*'ENTER DATA HERE - Budget'!$E$9-('ENTER DATA HERE - Budget'!$H$45-'ENTER DATA HERE - Budget'!$H$36)-'ENTER DATA HERE - Budget'!$F$36*'ENTER DATA HERE - Budget'!$E$9*'Sensitivity Analysis'!$A5-'ENTER DATA HERE - Budget'!$H$54)/('ENTER DATA HERE - Budget'!$E$9*'ENTER DATA HERE - Budget'!$E$10)","v":1226.2747073151045}]
[0.4,{"$f":"(B$4*'ENTER DATA HERE - Budget'!$F$30*'ENTER DATA HERE - Budget'!$E$9-('ENTER DATA HERE - Budget'!$H$45-'ENTER DATA HERE - Budget'!$H$36)-'ENTER DATA HERE - Budget'!$F$36*'ENTER DATA HERE - Budget'!$E$9*'Sensitivity Analysis'!$A6-'ENTER DATA HERE - Budget'!$H$54)/('ENTER DATA HERE - Budget'!$E$9*'ENTER DATA HERE - Budget'!$E$10)","v":930.89222465885393},{"$f":"(C$4*'ENTER DATA HERE - Budget'!$F$30*'ENTER DATA HERE - Budget'!$E$9-('ENTER DATA HERE - Budget'!$H$45-'ENTER DATA HERE - Budget'!$H$36)-'ENTER DATA HERE - Budget'!$F$36*'ENTER DATA HERE - Budget'!$E$9*'Sensitivity Analysis'!$A6-'ENTER DATA HERE - Budget'!$H$54)/('ENTER DATA HERE - Budget'!$E$9*'ENTER DATA HERE - Budget'!$E$10)","v":962.10106372135442},{"$f":"(D$4*'ENTER DATA HERE - Budget'!$F$30*'ENTER DATA HERE - Budget'!$E$9-('ENTER DATA HERE - Budget'!$H$45-'ENTER DATA HERE - Budget'!$H$36)-'ENTER DATA HERE - Budget'!$F$36*'ENTER DATA HERE - Budget'!$E$9*'Sensitivity Analysis'!$A6-'ENTER DATA HERE - Budget'!$H$54)/('ENTER DATA HERE - Budget'!$E$9*'ENTER DATA HERE - Budget'!$E$10)","v":993.30990278385411},{"$f":"(E$4*'ENTER DATA HERE - Budget'!$F$30*'ENTER DATA HERE - Budget'!$E$9-('ENTER DATA HERE - Budget'!$H$45-'ENTER DATA HERE - Budget'!$H$36)-'ENTER DATA HERE - Budget'!$F$36*'ENTER DATA HERE - Budget'!$E$9*'Sensitivity Analysis'!$A6-'ENTER DATA HERE - Budget'!$H$54)/('ENTER DATA HERE - Budget'!$E$9*'ENTER DATA HERE - Budget'!$E$10)","v":1024.5187418463543},{"$f":"(F$4*'ENTER DATA HERE - Budget'!$F$30*'ENTER DATA HERE - Budget'!$E$9-('ENTER DATA HERE - Budget'!$H$45-'ENTER DATA HERE - Budget'!$H$36)-'ENTER DATA HERE - Budget'!$F$36*'ENTER DATA HERE - Budget'!$E$9*'Sensitivity Analysis'!$A6-'ENTER DATA HERE - Budget'!$H$54)/('ENTER DATA HERE - Budget'!$E$9*'ENTER DATA HERE - Budget'!$E$10)","v":1055.7275809088542},{"$f":"(G$4*'ENTER DATA HERE - Budget'!$F$30*'ENTER DATA HERE - Budget'!$E$9-('ENTER DATA HERE - Budget'!$H$45-'ENTER DATA HERE - Budget'!$H$36)-'ENTER DATA HERE - Budget'!$F$36*'ENTER DATA HERE - Budget'!$E$9*'Sensitivity Analysis'!$A6-'ENTER DATA HERE - Budget'!$H$54)/('ENTER DATA HERE - Budget'!$E$9*'ENTER DATA HERE - Budget'!$E$10)","v":1086.9364199713539},{"$f":"(H$4*'ENTER DATA HERE - Budget'!$F$30*'ENTER DATA HERE - Budget'!$E$9-('ENTER DATA HERE - Budget'!$H$45-'ENTER DATA HERE - Budget'!$H$36)-'ENTER DATA HERE - Budget'!$F$36*'ENTER DATA HERE - Budget'!$E$9*'Sensitivity Analysis'!$A6-'ENTER DATA HERE - Budget'!$H$54)/('ENTER DATA HERE - Budget'!$E$9*'ENTER DATA HERE - Budget'!$E$10)","v":1118.1452590338542},{"$f":"(I$4*'ENTER DATA HERE - Budget'!$F$30*'ENTER DATA HERE - Budget'!$E$9-('ENTER DATA HERE - Budget'!$H$45-'ENTER DATA HERE - Budget'!$H$36)-'ENTER DATA HERE - Budget'!$F$36*'ENTER DATA HERE - Budget'!$E$9*'Sensitivity Analysis'!$A6-'ENTER DATA HERE - Budget'!$H$54)/('ENTER DATA HERE - Budget'!$E$9*'ENTER DATA HERE - Budget'!$E$10)","v":1149.3540980963544},{"$f":"(J$4*'ENTER DATA HERE - Budget'!$F$30*'ENTER DATA HERE - Budget'!$E$9-('ENTER DATA HERE - Budget'!$H$45-'ENTER DATA HERE - Budget'!$H$36)-'ENTER DATA HERE - Budget'!$F$36*'ENTER DATA HERE - Budget'!$E$9*'Sensitivity Analysis'!$A6-'ENTER DATA HERE - Budget'!$H$54)/('ENTER DATA HERE - Budget'!$E$9*'ENTER DATA HERE - Budget'!$E$10)","v":1180.5629371588545}]
{"$rows_left_out":27}
{"sheet":"Schedule","index":5,"n_rows":31,"n_cols":16,"rows_kept":31,"cut":false,"hidden":false,"merged":[]}
[]
[null,null,null,"January","February","March","April","May","June","July","August","September","October","November","December"]
[null,"Year 1","Stock",{"$f":"IF('Cash Flow'!$V4='ENTER DATA HERE - Budget'!$E$10,\"Stock\",\"\")","v":""},{"$f":"IF('Cash Flow'!$V5='ENTER DATA HERE - Budget'!$E$10,\"Stock\",\"\")","v":""},{"$f":"IF('Cash Flow'!$V6='ENTER DATA HERE - Budget'!$E$10,\"Stock\",\"\")","v":""},{"$f":"IF('Cash Flow'!$V7='ENTER DATA HERE - Budget'!$E$10,\"Stock\",\"\")","v":"Stock"},{"$f":"IF('Cash Flow'!$V8='ENTER DATA HERE - Budget'!$E$10,\"Stock\",\"\")","v":"Stock"},{"$f":"IF('Cash Flow'!$V9='ENTER DATA HERE - Budget'!$E$10,\"Stock\",\"\")","v":"Stock"},{"$f":"IF('Cash Flow'!$V10='ENTER DATA HERE - Budget'!$E$10,\"Stock\",\"\")","v":""},{"$f":"IF('Cash Flow'!$V11='ENTER DATA HERE - Budget'!$E$10,\"Stock\",\"\")","v":""},{"$f":"IF('Cash Flow'!$V12='ENTER DATA HERE - Budget'!$E$10,\"Stock\",\"\")","v":""},{"$f":"IF('Cash Flow'!$V13='ENTER DATA HERE - Budget'!$E$10,\"Stock\",\"\")","v":""},{"$f":"IF('Cash Flow'!$V14='ENTER DATA HERE - Budget'!$E$10,\"Stock\",\"\")","v":""},{"$f":"IF('Cash Flow'!$V15='ENTER DATA HERE - Budget'!$E$10,\"Stock\",\"\")","v":""}]
[null,null,"Harvest",{"$f":"IF('Cash Flow'!$W4='ENTER DATA HERE - Budget'!$E$10,\"Harvest\",\"\")","v":""},{"$f":"IF('Cash Flow'!$W5='ENTER DATA HERE - Budget'!$E$10,\"Harvest\",\"\")","v":""},{"$f":"IF('Cash Flow'!$W6='ENTER DATA HERE - Budget'!$E$10,\"Harvest\",\"\")","v":""},{"$f":"IF('Cash Flow'!$W7='ENTER DATA HERE - Budget'!$E$10,\"Harvest\",\"\")","v":""},{"$f":"IF('Cash Flow'!$W8='ENTER DATA HERE - Budget'!$E$10,\"Harvest\",\"\")","v":""},{"$f":"IF('Cash Flow'!$W9='ENTER DATA HERE - Budget'!$E$10,\"Harvest\",\"\")","v":""},{"$f":"IF('Cash Flow'!$W10='ENTER DATA HERE - Budget'!$E$10,\"Harvest\",\"\")","v":""},{"$f":"IF('Cash Flow'!$W11='ENTER DATA HERE - Budget'!$E$10,\"Harvest\",\"\")","v":""},{"$f":"IF('Cash Flow'!$W12='ENTER DATA HERE - Budget'!$E$10,\"Harvest\",\"\")","v":""},{"$f":"IF('Cash Flow'!$W13='ENTER DATA HERE - Budget'!$E$10,\"Harvest\",\"\")","v":""},{"$f":"IF('Cash Flow'!$W14='ENTER DATA HERE - Budget'!$E$10,\"Harvest\",\"\")","v":""},{"$f":"IF('Cash Flow'!$W15='ENTER DATA HERE - Budget'!$E$10,\"Harvest\",\"\")","v":""}]
[]
[null,"Year 2","Stock",{"$f":"IF('Cash Flow'!$V16='ENTER DATA HERE - Budget'!$E$10,\"Stock\",\"\")","v":""},{"$f":"IF('Cash Flow'!$V17='ENTER DATA HERE - Budget'!$E$10,\"Stock\",\"\")","v":""},{"$f":"IF('Cash Flow'!$V18='ENTER DATA HERE - Budget'!$E$10,\"Stock\",\"\")","v":""},{"$f":"IF('Cash Flow'!$V19='ENTER DATA HERE - Budget'!$E$10,\"Stock\",\"\")","v":"Stock"},{"$f":"IF('Cash Flow'!$V20='ENTER DATA HERE - Budget'!$E$10,\"Stock\",\"\")","v":"Stock"},{"$f":"IF('Cash Flow'!$V21='ENTER DATA HERE - Budget'!$E$10,\"Stock\",\"\")","v":"Stock"},{"$f":"IF('Cash Flow'!$V22='ENTER DATA HERE - Budget'!$E$10,\"Stock\",\"\")","v":""},{"$f":"IF('Cash Flow'!$V23='ENTER DATA HERE - Budget'!$E$10,\"Stock\",\"\")","v":""},{"$f":"IF('Cash Flow'!$V24='ENTER DATA HERE - Budget'!$E$10,\"Stock\",\"\")","v":""},{"$f":"IF('Cash Flow'!$V25='ENTER DATA HERE - Budget'!$E$10,\"Stock\",\"\")","v":""},{"$f":"IF('Cash Flow'!$V26='ENTER DATA HERE - Budget'!$E$10,\"Stock\",\"\")","v":""},{"$f":"IF('Cash Flow'!$V27='ENTER DATA HERE - Budget'!$E$10,\"Stock\",\"\")","v":""}]
{"$rows_left_out":25}