{"text_format":"1","workbook":"xlsx","n_sheets":18,"sheets":["Welcome Spreadsheet","Notes","SpecieData","Chart1","Enter Systems Parameters Here","Enter Operation Parameters Here","Cash Flow","Operating-Overhead Cost","Income Statement","Module1","Sheet7","Sheet6","Sheet2","Sheet1","Sheet5","Sheet4","Sheet3","SolverTableSheet"],"not_rendered":{"charts":4,"images":10,"macros":1,"external_links":1,"defined_names":76,"comments":1,"pivot_tables":0},"unopened":[{"sheet":"Chart1","index":3,"reason":"not_a_worksheet"}],"bounds":{"document_bytes":16777216,"sheet_cells":100000,"rows_first":2000,"rows_last":500,"rows_between":2000,"halvings":0,"cell_chars":16384,"cell_head_chars":4096},"cells_cut":0,"cells_raw":0,"read":"whole","date_system":"1900"}

{"sheet":"Welcome Spreadsheet","index":0,"n_rows":31,"n_cols":4,"rows_kept":31,"cut":false,"hidden":false,"merged":[[0,1,2,18],[30,3,30,16]]}
[null,"Indoor Recirculating Aquaculture Analysis"]
[]
[]
[]
[]
[]
[]
[]
{"$rows_left_out":24}
{"sheet":"Notes","index":1,"n_rows":32,"n_cols":2,"rows_kept":32,"cut":false,"hidden":false,"merged":[[2,0,2,1],[21,0,21,1],[31,0,31,1]]}
[]
["SPECIES DATA"]
["This worksheet contains the species data relating to growth rates of four (4) species; Hybrid Striped Bass, Tilapia, Yellow Perch and Shrimp. It is coded “orange,” meaning you can cautiously change the growth rates for the various species if you know what your actual growth rates are. Otherwise, do not touch this worksheet."]
[]
["ENTER SYSTEMS PARAMETERS HERE"]
["This worksheet is coded “green” meaning proceed to enter your data relating to the system. Please enter data in yellow cells with blue font to reflect your situation."]
[]
["Stocking year:","Enter the year you want to begin your operation."]
{"$rows_left_out":25}
{"sheet":"SpecieData","index":2,"n_rows":52,"n_cols":12,"rows_kept":52,"cut":false,"hidden":false,"merged":[[32,1,32,3],[32,4,32,6],[32,7,32,9]]}
["Shrimp",0,1,2,10,20,25]
[1,2,3,4,5,6,7,8]
["Other fishes",10,30,50,80,100,200]
["Species","Daily grth rate: 10g","Daily grth rate: 30g","Daily grth rate: 50g","Daily grth rate: 80g","Daily grth rate: 100g","Daily grth rate: 200g","Daily grth rate: >200g"]
["Hybrid Striped Bass",0.2,0.2,0.7,0.7,0.8,2.5,2.65]
["Tilapia",0.2,0.4,1.59,1.79,2.69,3.69,5.9999000000000002]
["Yellow Perch",0.12,0.12,0.19900000000000001,0.5,1.9,2.7,3]
["Shrimp",1.4200000000000001E-2,1.4200000000000001E-2,1.4200000000000001E-2,0.214285,0.214285,0.214285,0.214285]
{"$rows_left_out":45}
{"sheet":"Enter Systems Parameters Here","index":4,"n_rows":69,"n_cols":60,"rows_kept":69,"cut":false,"hidden":false,"merged":[[8,1,8,2],[0,1,0,5],[1,1,1,8],[2,1,3,8]]}
[null,"RECIRCULATING AQUACULTURE SYSTEM"]
[null,"The budget presented below is a guide to assist you in projecting costs and returns for your aquaculture enterprise. This spreadsheet is just a tool to be used for planning your aquaculture operation and developing your own budget, specific to your situation."]
[null,"You should change the cells in yellow with blue font to reflect your situation."]
[]
[]
[]
["Stocking year",2012,"Enter the year you want to begin your operation"]
["Stocking Month","January","Enter the month you want to begin stocking fish.",null,null,null,null,null,null,null,null,null,null,null,null,null,"January",null,"Hybrid Striped Bass"]
{"$rows_left_out":62}
{"sheet":"Enter Operation Parameters Here","index":5,"n_rows":87,"n_cols":43,"rows_kept":87,"cut":false,"hidden":false,"merged":[[1,16,2,16]]}
[]
[]
[]
[null,"Capital Investment Costs",null,"Unit Cost","Number","Cost","Yrs of use","Salvage value","Yearly cost"]
[null,"Land","unit",null,1,{"$f":"+D5*E5","v":0},30,{"$f":"0.1*F5","v":0},{"$f":"(F5-H5)/G5","v":0}]
[null,"Building:  Pole barn with concrete floor","unit",25000,1,{"$f":"+D6*E6","v":25000},30,{"$f":"0.1*F6","v":2500},{"$f":"(F6-H6)/G6","v":750}]
[null,"Complete RAS System","unit",45000,1,{"$f":"+D7*E7","v":45000},10,{"$f":"0.1*F7","v":4500},{"$f":"(F7-H7)/G7","v":4050}]
[null,"Tank Plywood",null,28,258,{"$f":"+D8*E8","v":7224}]
{"$rows_left_out":80}
{"sheet":"Cash Flow","index":6,"n_rows":300,"n_cols":36,"rows_kept":300,"cut":false,"hidden":false,"merged":[[121,2,121,13],[0,2,0,13],[1,2,1,13],[31,2,31,13],[61,2,61,13],[91,2,91,13],[181,2,181,13],[211,2,211,13],[241,2,241,13],[271,2,271,13],[151,2,151,13]]}
[null,null,"CASH FLOW"]
[null,"YEAR 1","YEAR 1"]
[null,null,"January","February","March","April","May","June","July","August","September","October","November","December","Total",null,null,null,null,null,null,null,null,"January","February","March","April","May","June","July","August","September","October","November","December","Number of times"]
[{"$f":"'Enter Systems Parameters Here'!$B$7","v":2012},"Gross Receipts:",null,null,null,null,null,null,null,null,null,null,null,null,null,null,null,null,null,null,null,null,{"$f":"'Enter Systems Parameters Here'!A38","v":2012},"Stock nursery","Stock nursery","Stock nursery","Stock nursery","Stock nursery","Stock nursery","Stock nursery","Stock nursery","Stock nursery","Stock nursery","Stock nursery","Stock nursery",12]
[{"$f":"'Enter Systems Parameters Here'!$B$7","v":2012},"Fish sale",{"$f":"IF('Enter Systems Parameters Here'!B$39=\"Harvest\", 'Enter Operation Parameters Here'!$D$84*'Enter Operation Parameters Here'!$G$44,0)","v":0},{"$f":"IF('Enter Systems Parameters Here'!C$39=\"Harvest\", 'Enter Operation Parameters Here'!$D$84*'Enter Operation Parameters Here'!$G$44,0)","v":0},{"$f":"IF('Enter Systems Parameters Here'!D$39=\"Harvest\", 'Enter Operation Parameters Here'!$D$84*'Enter Operation Parameters Here'!$G$44,0)","v":0},{"$f":"IF('Enter Systems Parameters Here'!E$39=\"Harvest\", 'Enter Operation Parameters Here'!$D$84*'Enter Operation Parameters Here'!$G$44,0)","v":0},{"$f":"IF('Enter Systems Parameters Here'!F$39=\"Harvest\", 'Enter Operation Parameters Here'!$D$84*'Enter Operation Parameters Here'!$G$44,0)","v":6610.6816821532457},{"$f":"IF('Enter Systems Parameters Here'!G$39=\"Harvest\", 'Enter Operation Parameters Here'!$D$84*'Enter Operation Parameters Here'!$G$44,0)","v":6610.6816821532457},{"$f":"IF('Enter Systems Parameters Here'!H$39=\"Harvest\", 'Enter Operation Parameters Here'!$D$84*'Enter Operation Parameters Here'!$G$44,0)","v":6610.6816821532457},{"$f":"IF('Enter Systems Parameters Here'!I$39=\"Harvest\", 'Enter Operation Parameters Here'!$D$84*'Enter Operation Parameters Here'!$G$44,0)","v":6610.6816821532457},{"$f":"IF('Enter Systems Parameters Here'!J$39=\"Harvest\", 'Enter Operation Parameters Here'!$D$84*'Enter Operation Parameters Here'!$G$44,0)","v":6610.6816821532457},{"$f":"IF('Enter Systems Parameters Here'!K$39=\"Harvest\", 'Enter Operation Parameters Here'!$D$84*'Enter Operation Parameters Here'!$G$44,0)","v":6610.6816821532457},{"$f":"IF('Enter Systems Parameters Here'!L$39=\"Harvest\", 'Enter Operation Parameters Here'!$D$84*'Enter Operation Parameters Here'!$G$44,0)","v":6610.6816821532457},{"$f":"IF('Enter Systems Parameters Here'!M$39=\"Harvest\", 'Enter Operation Parameters Here'!$D$84*'Enter Operation Parameters Here'!$G$44,0)","v":6610.6816821532457},{"$f":"SUM(C5:N5)","v":52885.453457225973},null,null,null,null,null,null,null,null,"Stock P2","Stock P2","Stock P2","Stock P2","Stock P2","Stock P2","Stock P2","Stock P2","Stock P2","Stock P2","Stock P2","Stock P2",12]
[{"$f":"'Enter Systems Parameters Here'!$B$7","v":2012},"Miscellaneous Receipts",null,null,null,null,null,null,null,null,null,null,null,null,{"$f":"SUM(C6:N6)","v":0},null,null,null,null,null,null,null,null,null,null,null,null,null,null,null,null,null,null,null,null,0]
[{"$f":"'Enter Systems Parameters Here'!$B$7","v":2012},"Total Receipts",{"$f":"SUM(C5:C6)","v":0},0,0,0,6610.6816821532457,6610.6816821532457,6610.6816821532457,6610.6816821532457,6610.6816821532457,6610.6816821532457,6610.6816821532457,6610.6816821532457,{"$f":"SUM(C7:N7)","v":52885.453457225973},null,null,null,null,null,null,null,{"$f":"'Enter Systems Parameters Here'!A41","v":2013},"Stock nursery","Stock nursery","Stock nursery","Stock nursery","Stock nursery","Stock nursery","Stock nursery","Stock nursery","Stock nursery","Stock nursery","Stock nursery","Stock nursery",12]
[{"$f":"'Enter Systems Parameters Here'!$B$7","v":2012},null,null,null,null,null,null,null,null,null,null,null,null,null,null,null,null,null,null,null,null,null,null,"Stock P2","Stock P2","Stock P2","Stock P2","Stock P2","Stock P2","Stock P2","Stock P2","Stock P2","Stock P2","Stock P2","Stock P2",12]
{"$rows_left_out":293}
{"sheet":"Operating-Overhead Cost","index":7,"n_rows":19,"n_cols":11,"rows_kept":19,"cut":false,"hidden":false,"merged":[]}
[null,{"$f":"'Cash Flow'!W4","v":2012},{"$f":"'Cash Flow'!W7","v":2013},{"$f":"'Cash Flow'!W10","v":2014},{"$f":"'Cash Flow'!W13","v":2015},{"$f":"'Cash Flow'!W16","v":2016},{"$f":"'Cash Flow'!W19","v":2017},{"$f":"'Cash Flow'!W22","v":2018},{"$f":"'Cash Flow'!W25","v":2019},{"$f":"'Cash Flow'!W28","v":2020},{"$f":"'Cash Flow'!W31","v":2021}]
[]
["Fingerlings",{"$f":"'Enter Operation Parameters Here'!F54*'Cash Flow'!$AJ$16","v":16654.579460043198},{"$f":"'Enter Operation Parameters Here'!F54*'Cash Flow'!$AJ$19","v":16654.579460043198},{"$f":"'Enter Operation Parameters Here'!F54*'Cash Flow'!$AJ$10","v":16654.579460043198},{"$f":"'Enter Operation Parameters Here'!F54*'Cash Flow'!$AJ$13","v":16654.579460043198},{"$f":"'Enter Operation Parameters Here'!F54*'Cash Flow'!$AJ$16","v":16654.579460043198},{"$f":"'Enter Operation Parameters Here'!F54*'Cash Flow'!$AJ$19","v":16654.579460043198},{"$f":"'Enter Operation Parameters Here'!F54*'Cash Flow'!$AJ$22","v":16654.579460043198},{"$f":"'Enter Operation Parameters Here'!F54*'Cash Flow'!$AJ$25","v":16654.579460043198},{"$f":"'Enter Operation Parameters Here'!F54*'Cash Flow'!$AJ$28","v":16654.579460043198},{"$f":"'Enter Operation Parameters Here'!F54*'Cash Flow'!$AJ$31","v":16654.579460043198}]
["Feed (wt avg)",{"$f":"'Enter Operation Parameters Here'!$D$46*'Enter Operation Parameters Here'!$D$39*'Cash Flow'!AJ4+'Enter Operation Parameters Here'!$E$46*'Enter Operation Parameters Here'!$E$39*'Cash Flow'!AJ5+'Enter Operation Parameters Here'!$F$46*'Enter Operation Parameters Here'!$F$39*'Cash Flow'!AJ5","v":6766.5346150741343},{"$f":"'Enter Operation Parameters Here'!$D$46*'Enter Operation Parameters Here'!$D$39*'Cash Flow'!AJ7+'Enter Operation Parameters Here'!$E$46*'Enter Operation Parameters Here'!$E$39*'Cash Flow'!AJ8+'Enter Operation Parameters Here'!$F$46*'Enter Operation Parameters Here'!$F$39*'Cash Flow'!AJ9","v":6766.5346150741343},{"$f":"'Enter Operation Parameters Here'!$D$46*'Enter Operation Parameters Here'!$D$39*'Cash Flow'!AJ10+'Enter Operation Parameters Here'!$E$46*'Enter Operation Parameters Here'!$E$39*'Cash Flow'!AJ11+'Enter Operation Parameters Here'!$F$46*'Enter Operation Parameters Here'!$F$39*'Cash Flow'!AJ12","v":6766.5346150741343},{"$f":"'Enter Operation Parameters Here'!$D$46*'Enter Operation Parameters Here'!$D$39*'Cash Flow'!AJ13+'Enter Operation Parameters Here'!$E$46*'Enter Operation Parameters Here'!$E$39*'Cash Flow'!AJ14+'Enter Operation Parameters Here'!$F$46*'Enter Operation Parameters Here'!$F$39*'Cash Flow'!AJ15","v":6766.5346150741343},{"$f":"'Enter Operation Parameters Here'!$D$46*'Enter Operation Parameters Here'!$D$39*'Cash Flow'!AJ16+'Enter Operation Parameters Here'!$E$46*'Enter Operation Parameters Here'!$E$39*'Cash Flow'!AJ17+'Enter Operation Parameters Here'!$F$46*'Enter Operation Parameters Here'!$F$39*'Cash Flow'!AJ18","v":6766.5346150741343},{"$f":"'Enter Operation Parameters Here'!$D$46*'Enter Operation Parameters Here'!$D$39*'Cash Flow'!AJ19+'Enter Operation Parameters Here'!$E$46*'Enter Operation Parameters Here'!$E$39*'Cash Flow'!AJ20+'Enter Operation Parameters Here'!$F$46*'Enter Operation Parameters Here'!$F$39*'Cash Flow'!AJ21","v":6766.5346150741343},{"$f":"'Enter Operation Parameters Here'!$D$46*'Enter Operation Parameters Here'!$D$39*'Cash Flow'!AJ22+'Enter Operation Parameters Here'!$E$46*'Enter Operation Parameters Here'!$E$39*'Cash Flow'!AJ23+'Enter Operation Parameters Here'!$F$46*'Enter Operation Parameters Here'!$F$39*'Cash Flow'!AJ24","v":6766.5346150741343},{"$f":"'Enter Operation Parameters Here'!$D$46*'Enter Operation Parameters Here'!$D$39*'Cash Flow'!AJ25+'Enter Operation Parameters Here'!$E$46*'Enter Operation Parameters Here'!$E$39*'Cash Flow'!AJ26+'Enter Operation Parameters Here'!$F$46*'Enter Operation Parameters Here'!$F$39*'Cash Flow'!AJ27","v":6766.5346150741343},{"$f":"'Enter Operation Parameters Here'!$D$46*'Enter Operation Parameters Here'!$D$39*'Cash Flow'!AJ28+'Enter Operation Parameters Here'!$E$46*'Enter Operation Parameters Here'!$E$39*'Cash Flow'!AJ29+'Enter Operation Parameters Here'!$F$46*'Enter Operation Parameters Here'!$F$39*'Cash Flow'!AJ30","v":6766.5346150741343},{"$f":"'Enter Operation Parameters Here'!$D$46*'Enter Operation Parameters Here'!$D$39*'Cash Flow'!AJ31+'Enter Operation Parameters Here'!$E$46*'Enter Operation Parameters Here'!$E$39*'Cash Flow'!AJ32+'Enter Operation Parameters Here'!$F$46*'Enter Operation Parameters Here'!$F$39*'Cash Flow'!AJ33","v":6766.5346150741343}]
["Electricity",{"$f":"'Enter Operation Parameters Here'!$F$56*'Enter Systems Parameters Here'!N39","v":1133.2597169405565},{"$f":"'Enter Operation Parameters Here'!$F$56*'Enter Systems Parameters Here'!N42","v":1699.8895754108348},{"$f":"'Enter Operation Parameters Here'!$F$56*'Enter Systems Parameters Here'!N45","v":1699.8895754108348},{"$f":"'Enter Operation Parameters Here'!$F$56*'Enter Systems Parameters Here'!N48","v":1699.8895754108348},{"$f":"'Enter Operation Parameters Here'!$F$56*'Enter Systems Parameters Here'!N51","v":1699.8895754108348},{"$f":"'Enter Operation Parameters Here'!$F$56*'Enter Systems Parameters Here'!N54","v":1699.8895754108348},{"$f":"'Enter Operation Parameters Here'!$F$56*'Enter Systems Parameters Here'!N57","v":1699.8895754108348},{"$f":"'Enter Operation Parameters Here'!$F$56*'Enter Systems Parameters Here'!N60","v":1699.8895754108348},{"$f":"'Enter Operation Parameters Here'!$F$56*'Enter Systems Parameters Here'!N63","v":1699.8895754108348},{"$f":"'Enter Operation Parameters Here'!$F$56*'Enter Systems Parameters Here'!N66","v":1699.8895754108348}]
["Oxygen",{"$f":"'Enter Operation Parameters Here'!$F$57*'Enter Systems Parameters Here'!N39","v":326.14696844657334},{"$f":"'Enter Operation Parameters Here'!$F$57*'Enter Systems Parameters Here'!N42","v":489.22045266986004},{"$f":"'Enter Operation Parameters Here'!$F$57*'Enter Systems Parameters Here'!$N45","v":489.22045266986004},{"$f":"'Enter Operation Parameters Here'!$F$57*'Enter Systems Parameters Here'!$N48","v":489.22045266986004},{"$f":"'Enter Operation Parameters Here'!$F$57*'Enter Systems Parameters Here'!$N51","v":489.22045266986004},{"$f":"'Enter Operation Parameters Here'!$F$57*'Enter Systems Parameters Here'!$N54","v":489.22045266986004},{"$f":"'Enter Operation Parameters Here'!$F$57*'Enter Systems Parameters Here'!$N57","v":489.22045266986004},{"$f":"'Enter Operation Parameters Here'!$F$57*'Enter Systems Parameters Here'!$N60","v":489.22045266986004},{"$f":"'Enter Operation Parameters Here'!$F$57*'Enter Systems Parameters Here'!$N63","v":489.22045266986004},{"$f":"'Enter Operation Parameters Here'!$F$57*'Enter Systems Parameters Here'!$N66","v":489.22045266986004}]
["Hired labor",{"$f":"'Enter Operation Parameters Here'!$F$58*'Enter Systems Parameters Here'!$N39","v":16000},{"$f":"'Enter Operation Parameters Here'!$F$58*'Enter Systems Parameters Here'!$N42","v":24000},{"$f":"'Enter Operation Parameters Here'!$F$58*'Enter Systems Parameters Here'!$N45","v":24000},{"$f":"'Enter Operation Parameters Here'!$F$58*'Enter Systems Parameters Here'!$N48","v":24000},{"$f":"'Enter Operation Parameters Here'!$F$58*'Enter Systems Parameters Here'!$N51","v":24000},{"$f":"'Enter Operation Parameters Here'!$F$58*'Enter Systems Parameters Here'!$N54","v":24000},{"$f":"'Enter Operation Parameters Here'!$F$58*'Enter Systems Parameters Here'!$N57","v":24000},{"$f":"'Enter Operation Parameters Here'!$F$58*'Enter Systems Parameters Here'!$N60","v":24000},{"$f":"'Enter Operation Parameters Here'!$F$58*'Enter Systems Parameters Here'!$N63","v":24000},{"$f":"'Enter Operation Parameters Here'!$F$58*'Enter Systems Parameters Here'!$N66","v":24000}]
["Tansportation cost of fingerlings",{"$f":"'Enter Operation Parameters Here'!F59*'Cash Flow'!$AJ$16","v":0},{"$f":"'Enter Operation Parameters Here'!F59*'Cash Flow'!$AJ$19","v":0},{"$f":"'Enter Operation Parameters Here'!F59*'Cash Flow'!$AJ$10","v":0},{"$f":"'Enter Operation Parameters Here'!F59*'Cash Flow'!$AJ$13","v":0},{"$f":"'Enter Operation Parameters Here'!F59*'Cash Flow'!$AJ$16","v":0},{"$f":"'Enter Operation Parameters Here'!F59*'Cash Flow'!$AJ$19","v":0},{"$f":"'Enter Operation Parameters Here'!F59*'Cash Flow'!$AJ$22","v":0},{"$f":"'Enter Operation Parameters Here'!F59*'Cash Flow'!$AJ$25","v":0},{"$f":"'Enter Operation Parameters Here'!F59*'Cash Flow'!$AJ$28","v":0},{"$f":"'Enter Operation Parameters Here'!F59*'Cash Flow'!$AJ$31","v":0}]
{"$rows_left_out":12}
{"sheet":"Income Statement","index":8,"n_rows":25,"n_cols":13,"rows_kept":25,"cut":false,"hidden":false,"merged":[[24,3,24,10],[11,1,11,2],[12,1,12,2],[9,1,9,2],[14,1,14,2],[15,1,15,2],[16,1,16,2],[17,1,17,2],[4,1,4,2],[5,1,5,2],[6,1,6,2],[0,0,0,12],[13,1,13,2]]}
["INCOME STATEMENT                                            "]
[]
[null,null,null,{"$f":"'Enter Systems Parameters Here'!A38","v":2012},{"$f":"'Enter Systems Parameters Here'!A41","v":2013},{"$f":"'Enter Systems Parameters Here'!A44","v":2014},{"$f":"'Enter Systems Parameters Here'!A47","v":2015},{"$f":"'Enter Systems Parameters Here'!A50","v":2016},{"$f":"'Enter Systems Parameters Here'!A53","v":2017},{"$f":"'Enter Systems Parameters Here'!A56","v":2018},{"$f":"'Enter Systems Parameters Here'!A59","v":2019},{"$f":"'Enter Systems Parameters Here'!A62","v":2020},{"$f":"'Enter Systems Parameters Here'!A65","v":2021}]
[null,"REVENUE"]
[null,"Fish Sales",null,{"$f":"'Cash Flow'!$O$5","v":52885.453457225973},{"$f":"'Cash Flow'!$O$35","v":79328.180185838952},{"$f":"'Cash Flow'!$O$65","v":79328.180185838952},{"$f":"'Cash Flow'!$O$95","v":79328.180185838952},{"$f":"'Cash Flow'!$O$125","v":79328.180185838952},{"$f":"'Cash Flow'!$O$155","v":79328.180185838952},{"$f":"'Cash Flow'!O187","v":79328.180185838952},{"$f":"'Cash Flow'!O217","v":79328.180185838952},{"$f":"'Cash Flow'!O247","v":79328.180185838952},{"$f":"'Cash Flow'!O277","v":79328.180185838952}]
[null,"Other Income",null,{"$f":"'Cash Flow'!$O$6","v":0},{"$f":"'Cash Flow'!$O$36","v":0},{"$f":"'Cash Flow'!$O$66","v":0},{"$f":"'Cash Flow'!$O$96","v":0},{"$f":"'Cash Flow'!$O$126","v":0},{"$f":"'Cash Flow'!$O$156","v":0},{"$f":"'Cash Flow'!$O$156","v":0},{"$f":"'Cash Flow'!$O$156","v":0},{"$f":"'Cash Flow'!$O$156","v":0},{"$f":"'Cash Flow'!$O$156","v":0}]
[null,"Gross Revenue",null,{"$f":"SUM(D5:D6)","v":52885.453457225973},79328.180185838952,79328.180185838952,79328.180185838952,79328.180185838952,79328.180185838952,79328.180185838952,79328.180185838952,79328.180185838952,79328.180185838952]
[]
{"$rows_left_out":18}
{"sheet":"Module1","index":9,"n_rows":0,"n_cols":0,"rows_kept":0,"cut":false,"hidden":true,"merged":[]}

{"sheet":"Sheet7","index":10,"n_rows":0,"n_cols":0,"rows_kept":0,"cut":false,"hidden":true,"merged":[]}

{"sheet":"Sheet6","index":11,"n_rows":0,"n_cols":0,"rows_kept":0,"cut":false,"hidden":true,"merged":[]}

{"sheet":"Sheet2","index":12,"n_rows":0,"n_cols":0,"rows_kept":0,"cut":false,"hidden":true,"merged":[]}

{"sheet":"Sheet1","index":13,"n_rows":0,"n_cols":0,"rows_kept":0,"cut":false,"hidden":true,"merged":[]}

{"sheet":"Sheet5","index":14,"n_rows":0,"n_cols":0,"rows_kept":0,"cut":false,"hidden":true,"merged":[]}

{"sheet":"Sheet4","index":15,"n_rows":0,"n_cols":0,"rows_kept":0,"cut":false,"hidden":true,"merged":[]}

{"sheet":"Sheet3","index":16,"n_rows":0,"n_cols":0,"rows_kept":0,"cut":false,"hidden":true,"merged":[]}

{"sheet":"SolverTableSheet","index":17,"n_rows":15,"n_cols":2,"rows_kept":15,"cut":false,"hidden":true,"merged":[]}
[null,1]
[null,"$B$2"]
[null,1]
[null,0.1]
[null,1]
[null,0.1]
[null,""]
[null,"$F$2"]
{"$rows_left_out":7}